{"text_format":"1","workbook":"xlsx","n_sheets":6,"sheets":["MainMenu","記入例","男子","女子","男子DATA","女子DATA"],"not_rendered":{"charts":0,"images":0,"macros":1,"external_links":0,"defined_names":3,"comments":0,"pivot_tables":0},"unopened":[],"bounds":{"document_bytes":16777216,"sheet_cells":100000,"rows_first":2000,"rows_last":500,"rows_between":2000,"halvings":0,"cell_chars":16384,"cell_head_chars":4096},"cells_cut":0,"cells_raw":0,"read":"whole","date_system":"1900"}

{"sheet":"MainMenu","index":0,"n_rows":14,"n_cols":17,"rows_kept":14,"cut":false,"hidden":false,"merged":[[0,8,2,15],[0,16,2,22],[0,1,2,7],[13,2,14,8],[10,11,14,18]]}
[null,"高体連参加申込書",null,null,null,null,null,null,"S-system",null,null,null,null,null,null,null,"©S-system2023"]
[]
[]
[]
[]
[null,null,null,"大会年度の設定"]
[null,null,null,"令和",6,"年度"]
[]
[null,null,null,"線審名簿日程の設定"]
[null,null,null,"1日目",5,"月",22,"日"]
[null,null,null,"2日目",5,"月",23,"日",null,null,null,"氏名の入力について\n　・選手、監督・コーチ・マネージャーの氏名については、文字間に空白を入れて\n　全角７文字になるようにお願いします\n　・各校で入力方法が違うと、プログラムの選手名簿やトーナメント表の表記で\n　体裁を整えるための事務局の作業が膨大になります\n　・ご協力よろしくお願いします\n　※全角で７文字以上の名前の場合は、そのまま入力して下さい"]
[null,null,null,"3日目",5,"月",24,"日"]
[]
[null,null,"※この設定は事前に大会事務局が\n行った上で各校に配布して下さい"]

{"sheet":"記入例","index":1,"n_rows":46,"n_cols":30,"rows_kept":46,"cut":false,"hidden":false,"merged":[[45,3,45,10],[45,11,45,15],[45,16,45,17],[4,9,4,17],[37,3,37,6],[37,8,37,11],[37,13,37,16],[39,0,39,17],[43,1,43,2],[35,3,35,6],[35,8,35,11],[35,13,35,16],[36,3,36,6],[36,8,36,11],[36,13,36,16],[33,3,33,6],[33,8,33,11],[33,13,33,16],[34,3,34,6],[34,8,34,11],[34,13,34,16],[26,16,27,17],[27,1,27,4],[27,6,27,11],[24,14,25,15],[24,16,25,17],[25,1,25,4],[25,6,25,11],[33,1,33,2],[34,1,34,2],[26,0,27,0],[26,1,26,4],[26,5,27,5],[26,6,26,11],[26,12,27,13],[26,14,27,15],[22,12,23,13],[22,14,23,15],[22,16,23,17],[23,1,23,4],[23,6,23,11],[24,0,25,0],[24,1,24,4],[24,5,25,5],[24,6,24,11],[24,12,25,13],[22,0,23,0],[22,1,22,4],[22,5,23,5],[22,6,22,11],[18,16,19,17],[19,1,19,4],[19,6,19,11],[20,0,21,0],[20,1,20,4],[20,5,21,5],[20,6,20,11],[20,12,21,13],[20,14,21,15],[20,16,21,17],[18,0,19,0],[18,1,18,4],[18,5,19,5],[18,6,18,11],[18,12,19,13],[18,14,19,15],[21,1,21,4],[21,6,21,11],[14,12,15,13],[14,14,15,15],[14,16,15,17],[15,1,15,4],[15,6,15,11],[16,0,17,0],[16,1,16,4],[16,5,17,5],[16,6,16,11],[16,12,17,13],[16,14,17,15],[16,16,17,17],[17,1,17,4],[17,6,17,11],[12,5,13,5],[12,6,12,11],[12,12,13,13],[12,14,13,15],[12,16,13,17],[10,0,11,0],[10,1,10,4],[10,5,11,5],[10,6,10,11],[10,12,11,13],[10,14,11,15],[0,0,0,17],[1,1,1,2],[2,0,2,7],[2,8,2,17],[3,0,4,7],[3,9,3,11],[3,13,3,17],[7,16,7,17],[8,0,9,0],[8,1,8,4],[8,5,9,5],[8,6,8,11],[8,12,9,13],[8,14,9,15],[8,16,9,17],[9,1,9,4],[9,6,9,11],[6,0,7,0],[6,1,6,4],[6,5,7,5],[6,6,6,11],[6,12,6,13],[6,14,6,17],[7,1,7,4],[35,1,35,2],[36,1,36,2],[37,1,37,2],[38,1,38,17],[5,0,5,1],[5,2,5,5],[5,6,5,7],[5,8,5,11],[5,12,5,13],[5,14,5,17],[7,6,7,11],[7,12,7,13],[7,14,7,15],[13,1,13,4],[13,6,13,11],[14,0,15,0],[14,1,14,4],[14,5,15,5],[14,6,14,11],[10,16,11,17],[11,1,11,4],[11,6,11,11],[12,0,13,0],[12,1,12,4]]}
["令和６年度　高体連小樽支部バドミントン選手権大会参加申込書"]
["性別","男　子"]
["学　　校　　名",null,null,null,null,null,null,null,"学　校　所　在　地",null,null,null,null,null,null,null,null,null,null,"【学校情報の入力】"]
["小樽○○○高等学校",null,null,null,null,null,null,null,"〒","000-0000",null,null,"Tel","0134-00-0000",null,null,null,null,null,"1.学校名をリストから選択して下さい"]
[null,null,null,null,null,null,null,null,null,"小樽市○○町○丁目１－２",null,null,null,null,null,null,null,null,null,"2.学校所在地の郵便番号・電話番号・住所を入力して下さい"]
["監督",null,"○　○　○　○",null,null,null,"コーチ",null,"○　○　○　○",null,null,null,"マネージャー",null,"○　○　○　○"]
["人数","ふ　り　が　な",null,null,null,"学年","生　年　月　日",null,null,null,null,null,"主将◎",null,"個人戦",null,null,null,null,"【団体戦情報の入力】",null,null,null,null,null,null,null,"◎○","D１","S１"]
[null,"選　手　氏　名",null,null,null,null,"協 会 登 録 番 号",null,null,null,null,null,"団体○",null,"複(D印)",null,"単(S印)",null,null,"3.監督・コーチ・マネージャーを入力して下さい",null,null,null,null,null,null,null,"◎","D２","S２"]
[1,"○○　たろう",null,null,null,3,"2006.05.05",null,null,null,null,null,"◎○",null,"D２",null,"S１",null,null,"　※監督は必須です　コーチ・マネージャーは空欄でもOKです",null,null,null,null,null,null,null,"○","D３","S３"]
[null,"○　○　太　郎",null,null,null,null,1234567890,null,null,null,null,null,null,null,null,null,null,null,null,"4.選手の氏名・ふりがな・学年・生年月日・協会登録番号(10桁)を"]
[2,"○○　じろう",null,null,null,3,null,null,null,null,null,null,"○",null,"D１",null,"S２",null,null,"　入力して下さい"]
[null,"○　○　次　郎",null,null,null,null,null,null,null,null,null,null,null,null,null,null,null,null,null,"　※生年月日で月または日が1桁の場合は「0」を入れて下さい"]
[3,"○○　さぶろう",null,null,null,3,null,null,null,null,null,null,"○",null,"D２",null,null,null,null,"　※登録番号は「申請中」「不明」でもOKです"]
[null,"○　○　三　郎",null,null,null,null,null,null,null,null,null,null,null,null,null,null,null,null,null,"5.団体戦出場選手は「○」を選択して下さい"]
[4,"○○　しろう",null,null,null,2,null,null,null,null,null,null,"○",null,null,null,null,null,null,"　※団体メンバーは間を開けずに記入して下さい"]
{"$rows_left_out":32}
{"sheet":"男子","index":2,"n_rows":46,"n_cols":24,"rows_kept":46,"cut":false,"hidden":false,"merged":[[39,0,39,17],[43,1,43,2],[45,11,45,15],[45,3,45,10],[45,16,45,17],[4,9,4,17],[36,3,36,6],[36,8,36,11],[36,13,36,16],[37,3,37,6],[37,8,37,11],[37,13,37,16],[35,3,35,6],[35,8,35,11],[35,13,35,16],[33,3,33,6],[33,8,33,11],[34,13,34,16],[34,3,34,6],[34,8,34,11],[33,13,33,16],[26,14,27,15],[26,16,27,17],[27,1,27,4],[27,6,27,11],[0,0,0,17],[1,1,1,2],[24,12,25,13],[24,14,25,15],[24,16,25,17],[25,1,25,4],[25,6,25,11],[26,0,27,0],[26,1,26,4],[26,5,27,5],[26,6,26,11],[26,12,27,13],[23,1,23,4],[23,6,23,11],[24,0,25,0],[24,1,24,4],[20,0,21,0],[20,1,20,4],[20,5,21,5],[20,6,20,11],[20,12,21,13],[20,14,21,15],[24,5,25,5],[24,6,24,11],[20,16,21,17],[21,1,21,4],[21,6,21,11],[22,0,23,0],[22,1,22,4],[22,5,23,5],[22,6,22,11],[22,12,23,13],[22,14,23,15],[22,16,23,17],[16,16,17,17],[17,1,17,4],[17,6,17,11],[18,0,19,0],[18,1,18,4],[18,5,19,5],[18,6,18,11],[18,12,19,13],[18,14,19,15],[18,16,19,17],[19,1,19,4],[19,6,19,11],[16,0,17,0],[16,1,16,4],[16,5,17,5],[16,6,16,11],[16,12,17,13],[10,14,11,15],[10,16,11,17],[11,1,11,4],[11,6,11,11],[16,14,17,15],[12,16,13,17],[13,1,13,4],[13,6,13,11],[14,0,15,0],[14,1,14,4],[14,5,15,5],[14,6,14,11],[14,12,15,13],[14,14,15,15],[14,16,15,17],[12,0,13,0],[12,1,12,4],[12,5,13,5],[12,6,12,11],[12,12,13,13],[12,14,13,15],[15,1,15,4],[15,6,15,11],[10,0,11,0],[10,1,10,4],[10,5,11,5],[10,6,10,11],[10,12,11,13],[8,1,8,4],[8,6,8,11],[9,1,9,4],[9,6,9,11],[6,1,6,4],[7,1,7,4],[6,6,6,11],[7,6,7,11],[8,0,9,0],[8,5,9,5],[8,12,9,13],[8,14,9,15],[8,16,9,17],[38,1,38,17],[37,1,37,2],[36,1,36,2],[35,1,35,2],[34,1,34,2],[33,1,33,2],[5,12,5,13],[5,14,5,17],[2,0,2,7],[2,8,2,17],[3,0,4,7],[3,9,3,11],[3,13,3,17],[5,0,5,1],[5,6,5,7],[5,2,5,5],[5,8,5,11],[6,14,6,17],[7,14,7,15],[7,16,7,17],[6,12,6,13],[7,12,7,13],[6,0,7,0],[6,5,7,5]]}
[{"$f":"MainMenu!D7&MainMenu!E7&\"年度　高体連小樽支部バドミントン選手権大会参加申込書\"","v":"令和6年度　高体連小樽支部バドミントン選手権大会参加申込書"}]
["性別","男　子"]
["学　　校　　名",null,null,null,null,null,null,null,"学　校　所　在　地"]
[null,null,null,null,null,null,null,null,"〒",null,null,null,"Tel"]
[]
["監督",null,null,null,null,null,"コーチ",null,null,null,null,null,"マネージャー"]
["人数","ふ　り　が　な",null,null,null,"学年","生　年　月　日",null,null,null,null,null,"主将◎",null,"個人戦",null,null,null,null,"◎○","D１","S１","北海道小樽潮陵高等学校",101]
[null,"選　手　氏　名",null,null,null,null,"協 会 登 録 番 号",null,null,null,null,null,"団体○",null,"複(D印)",null,"単(S印)",null,null,"◎","D２","S２","北海道小樽桜陽高等学校",102]
[1,null,null,null,null,null,null,null,null,null,null,null,null,null,null,null,null,null,null,"○","D３","S３","北海道小樽未来創造高等学校",103]
[null,null,null,null,null,null,null,null,null,null,null,null,null,null,null,null,null,null,null,null,null,null,"北海道小樽水産高等学校",104]
[2,null,null,null,null,null,null,null,null,null,null,null,null,null,null,null,null,null,null,null,null,null,"北照高等学校",105]
[null,null,null,null,null,null,null,null,null,null,null,null,null,null,null,null,null,null,null,null,null,null,"小樽明峰高等学校",106]
[3,null,null,null,null,null,null,null,null,null,null,null,null,null,null,null,null,null,null,null,null,null,"小樽双葉高等学校",107]
[null,null,null,null,null,null,null,null,null,null,null,null,null,null,null,null,null,null,null,null,null,null,"北海道高等聾学校",108]
[4,null,null,null,null,null,null,null,null,null,null,null,null,null,null,null,null,null,null,null,null,null,"北海道寿都高等学校",109]
{"$rows_left_out":32}
{"sheet":"女子","index":3,"n_rows":46,"n_cols":24,"rows_kept":46,"cut":false,"hidden":false,"merged":[[45,3,45,10],[45,11,45,15],[45,16,45,17],[4,9,4,17],[37,3,37,6],[37,8,37,11],[37,13,37,16],[39,0,39,17],[43,1,43,2],[35,3,35,6],[35,8,35,11],[35,13,35,16],[36,3,36,6],[36,8,36,11],[36,13,36,16],[33,3,33,6],[33,8,33,11],[33,13,33,16],[34,3,34,6],[34,8,34,11],[34,13,34,16],[26,16,27,17],[27,1,27,4],[27,6,27,11],[24,14,25,15],[24,16,25,17],[25,1,25,4],[25,6,25,11],[33,1,33,2],[34,1,34,2],[26,0,27,0],[26,1,26,4],[26,5,27,5],[26,6,26,11],[26,12,27,13],[26,14,27,15],[22,12,23,13],[22,14,23,15],[22,16,23,17],[23,1,23,4],[23,6,23,11],[24,0,25,0],[24,1,24,4],[24,5,25,5],[24,6,24,11],[24,12,25,13],[22,0,23,0],[22,1,22,4],[22,5,23,5],[22,6,22,11],[18,16,19,17],[19,1,19,4],[19,6,19,11],[20,0,21,0],[20,1,20,4],[20,5,21,5],[20,6,20,11],[20,12,21,13],[20,14,21,15],[20,16,21,17],[18,0,19,0],[18,1,18,4],[18,5,19,5],[18,6,18,11],[18,12,19,13],[18,14,19,15],[21,1,21,4],[21,6,21,11],[14,12,15,13],[14,14,15,15],[14,16,15,17],[15,1,15,4],[15,6,15,11],[16,0,17,0],[16,1,16,4],[16,5,17,5],[16,6,16,11],[16,12,17,13],[16,14,17,15],[16,16,17,17],[17,1,17,4],[17,6,17,11],[12,5,13,5],[12,6,12,11],[12,12,13,13],[12,14,13,15],[12,16,13,17],[10,0,11,0],[10,1,10,4],[10,5,11,5],[10,6,10,11],[10,12,11,13],[10,14,11,15],[0,0,0,17],[1,1,1,2],[2,0,2,7],[2,8,2,17],[3,0,4,7],[3,9,3,11],[3,13,3,17],[7,16,7,17],[8,0,9,0],[8,1,8,4],[8,5,9,5],[8,6,8,11],[8,12,9,13],[8,14,9,15],[8,16,9,17],[9,1,9,4],[9,6,9,11],[6,0,7,0],[6,1,6,4],[6,5,7,5],[6,6,6,11],[6,12,6,13],[6,14,6,17],[7,1,7,4],[35,1,35,2],[36,1,36,2],[37,1,37,2],[38,1,38,17],[5,0,5,1],[5,2,5,5],[5,6,5,7],[5,8,5,11],[5,12,5,13],[5,14,5,17],[7,6,7,11],[7,12,7,13],[7,14,7,15],[13,1,13,4],[13,6,13,11],[14,0,15,0],[14,1,14,4],[14,5,15,5],[14,6,14,11],[10,16,11,17],[11,1,11,4],[11,6,11,11],[12,0,13,0],[12,1,12,4]]}
[{"$f":"MainMenu!D7&MainMenu!E7&\"年度　高体連小樽支部バドミントン選手権大会参加申込書\"","v":"令和6年度　高体連小樽支部バドミントン選手権大会参加申込書"}]
["性別","女　子"]
["学　　校　　名",null,null,null,null,null,null,null,"学　校　所　在　地"]
[null,null,null,null,null,null,null,null,"〒",null,null,null,"Tel"]
[]
["監督",null,null,null,null,null,"コーチ",null,null,null,null,null,"マネージャー"]
["人数","ふ　り　が　な",null,null,null,"学年","生　年　月　日",null,null,null,null,null,"主将◎",null,"個人戦",null,null,null,null,"◎○","D１","S１","北海道小樽潮陵高等学校",101]
[null,"選　手　氏　名",null,null,null,null,"協 会 登 録 番 号",null,null,null,null,null,"団体○",null,"複(D印)",null,"単(S印)",null,null,"◎","D２","S２","北海道小樽桜陽高等学校",102]
[1,null,null,null,null,null,null,null,null,null,null,null,null,null,null,null,null,null,null,"○","D３","S３","北海道小樽未来創造高等学校",103]
[null,null,null,null,null,null,null,null,null,null,null,null,null,null,null,null,null,null,null,null,null,null,"北海道小樽水産高等学校",104]
[2,null,null,null,null,null,null,null,null,null,null,null,null,null,null,null,null,null,null,null,null,null,"北照高等学校",105]
[null,null,null,null,null,null,null,null,null,null,null,null,null,null,null,null,null,null,null,null,null,null,"小樽明峰高等学校",106]
[3,null,null,null,null,null,null,null,null,null,null,null,null,null,null,null,null,null,null,null,null,null,"小樽双葉高等学校",107]
[null,null,null,null,null,null,null,null,null,null,null,null,null,null,null,null,null,null,null,null,null,null,"北海道高等聾学校",108]
[4,null,null,null,null,null,null,null,null,null,null,null,null,null,null,null,null,null,null,null,null,null,"北海道寿都高等学校",109]
{"$rows_left_out":32}
{"sheet":"男子DATA","index":4,"n_rows":12,"n_cols":18,"rows_kept":12,"cut":false,"hidden":true,"merged":[]}
[]
[null,"学校№","№","選手名","ふりがな","学年","団体","個人D","個人S","登録","生年月日",null,"氏名","学年","氏名","学年","氏名","学年"]
[{"$f":"VLOOKUP($A$5,男子!$W$7:$X$24,2,0)","v":{"$error":"#N/A"}},{"$f":"VLOOKUP($A$5,男子!$W$7:$X$24,2,0)","v":{"$error":"#N/A"}},1,{"$f":"IF(男子!B10=\"\",\"\",男子!B10)","v":""},{"$f":"IF(男子!B9=\"\",\"\",男子!B9)","v":""},{"$f":"IF(男子!F9=\"\",\"\",男子!F9)","v":""},{"$f":"IF(男子!M9=\"\",\"\",男子!M9)","v":""},{"$f":"IF(男子!O9=\"\",\"\",男子!O9)","v":""},{"$f":"IF(男子!Q9=\"\",\"\",男子!Q9)","v":""},{"$f":"IF(男子!G10=\"\",\"\",男子!G10)","v":""},{"$f":"IF(男子!G9=\"\",\"\",男子!G9)","v":""},"線審１",{"$f":"IF(男子!D35=\"\",\"\",男子!D35)","v":""},{"$f":"IF(男子!E35=\"\",\"\",男子!E35)","v":""},{"$f":"IF(男子!F35=\"\",\"\",男子!F35)","v":""},{"$f":"IF(男子!G35=\"\",\"\",男子!G35)","v":""},{"$f":"IF(男子!H35=\"\",\"\",男子!H35)","v":""},{"$f":"IF(男子!I35=\"\",\"\",男子!I35)","v":""}]
["学校名",{"$f":"VLOOKUP($A$5,男子!$W$7:$X$24,2,0)","v":{"$error":"#N/A"}},2,{"$f":"IF(男子!B12=\"\",\"\",男子!B12)","v":""},{"$f":"IF(男子!B11=\"\",\"\",男子!B11)","v":""},{"$f":"IF(男子!F11=\"\",\"\",男子!F11)","v":""},{"$f":"IF(男子!M11=\"\",\"\",男子!M11)","v":""},{"$f":"IF(男子!O11=\"\",\"\",男子!O11)","v":""},{"$f":"IF(男子!Q11=\"\",\"\",男子!Q11)","v":""},{"$f":"IF(男子!G12=\"\",\"\",男子!G12)","v":""},{"$f":"IF(男子!G11=\"\",\"\",男子!G11)","v":""},"線審２",{"$f":"IF(男子!D36=\"\",\"\",男子!D36)","v":""},{"$f":"IF(男子!E36=\"\",\"\",男子!E36)","v":""},{"$f":"IF(男子!F36=\"\",\"\",男子!F36)","v":""},{"$f":"IF(男子!G36=\"\",\"\",男子!G36)","v":""},{"$f":"IF(男子!H36=\"\",\"\",男子!H36)","v":""},{"$f":"IF(男子!I36=\"\",\"\",男子!I36)","v":""}]
[{"$f":"IF(男子!A4=\"\",\"\",男子!A4)","v":""},{"$f":"VLOOKUP($A$5,男子!$W$7:$X$24,2,0)","v":{"$error":"#N/A"}},3,{"$f":"IF(男子!B14=\"\",\"\",男子!B14)","v":""},{"$f":"IF(男子!B13=\"\",\"\",男子!B13)","v":""},{"$f":"IF(男子!F13=\"\",\"\",男子!F13)","v":""},{"$f":"IF(男子!M13=\"\",\"\",男子!M13)","v":""},{"$f":"IF(男子!O13=\"\",\"\",男子!O13)","v":""},{"$f":"IF(男子!Q13=\"\",\"\",男子!Q13)","v":""},{"$f":"IF(男子!G14=\"\",\"\",男子!G14)","v":""},{"$f":"IF(男子!G13=\"\",\"\",男子!G13)","v":""},"線審３",{"$f":"IF(男子!D37=\"\",\"\",男子!D37)","v":""},{"$f":"IF(男子!E37=\"\",\"\",男子!E37)","v":""},{"$f":"IF(男子!F37=\"\",\"\",男子!F37)","v":""},{"$f":"IF(男子!G37=\"\",\"\",男子!G37)","v":""},{"$f":"IF(男子!H37=\"\",\"\",男子!H37)","v":""},{"$f":"IF(男子!I37=\"\",\"\",男子!I37)","v":""}]
["監督",{"$f":"VLOOKUP($A$5,男子!$W$7:$X$24,2,0)","v":{"$error":"#N/A"}},4,{"$f":"IF(男子!B16=\"\",\"\",男子!B16)","v":""},{"$f":"IF(男子!B15=\"\",\"\",男子!B15)","v":""},{"$f":"IF(男子!F15=\"\",\"\",男子!F15)","v":""},{"$f":"IF(男子!M15=\"\",\"\",男子!M15)","v":""},{"$f":"IF(男子!O15=\"\",\"\",男子!O15)","v":""},{"$f":"IF(男子!Q15=\"\",\"\",男子!Q15)","v":""},{"$f":"IF(男子!G16=\"\",\"\",男子!G16)","v":""},{"$f":"IF(男子!G15=\"\",\"\",男子!G15)","v":""},"線審４",{"$f":"IF(男子!D38=\"\",\"\",男子!D38)","v":""},{"$f":"IF(男子!E38=\"\",\"\",男子!E38)","v":""},{"$f":"IF(男子!F38=\"\",\"\",男子!F38)","v":""},{"$f":"IF(男子!G38=\"\",\"\",男子!G38)","v":""},{"$f":"IF(男子!H38=\"\",\"\",男子!H38)","v":""},{"$f":"IF(男子!I38=\"\",\"\",男子!I38)","v":""}]
[{"$f":"IF(男子!C6=\"\",\"\",男子!C6)","v":""},{"$f":"VLOOKUP($A$5,男子!$W$7:$X$24,2,0)","v":{"$error":"#N/A"}},5,{"$f":"IF(男子!B18=\"\",\"\",男子!B18)","v":""},{"$f":"IF(男子!B17=\"\",\"\",男子!B17)","v":""},{"$f":"IF(男子!F17=\"\",\"\",男子!F17)","v":""},{"$f":"IF(男子!M17=\"\",\"\",男子!M17)","v":""},{"$f":"IF(男子!O17=\"\",\"\",男子!O17)","v":""},{"$f":"IF(男子!Q17=\"\",\"\",男子!Q17)","v":""},{"$f":"IF(男子!G18=\"\",\"\",男子!G18)","v":""},{"$f":"IF(男子!G17=\"\",\"\",男子!G17)","v":""},"D１",{"$f":"$A$3","v":{"$error":"#N/A"}},{"$f":"IFERROR(MATCH(L7,$H$3:$H$12,0),\"\")","v":""},"S１",{"$f":"$A$3","v":{"$error":"#N/A"}},{"$f":"IFERROR(INDEX($C$3:$C$12,MATCH(O7,$I$3:$I$12,0)),\"\")","v":""}]
["コーチ",{"$f":"VLOOKUP($A$5,男子!$W$7:$X$24,2,0)","v":{"$error":"#N/A"}},6,{"$f":"IF(男子!B20=\"\",\"\",男子!B20)","v":""},{"$f":"IF(男子!B19=\"\",\"\",男子!B19)","v":""},{"$f":"IF(男子!F19=\"\",\"\",男子!F19)","v":""},{"$f":"IF(男子!M19=\"\",\"\",男子!M19)","v":""},{"$f":"IF(男子!O19=\"\",\"\",男子!O19)","v":""},{"$f":"IF(男子!Q19=\"\",\"\",男子!Q19)","v":""},{"$f":"IF(男子!G20=\"\",\"\",男子!G20)","v":""},{"$f":"IF(男子!G19=\"\",\"\",男子!G19)","v":""},"D１",{"$f":"$A$3","v":{"$error":"#N/A"}},{"$f":"IFERROR(INDEX(C:C,1/LARGE(INDEX(($H$3:$H$7=L8)/ROW($H$3:$H$7),0),2)),\"\")","v":""},"S２",{"$error":"#N/A"},{"$f":"IFERROR(INDEX($C$3:$C$12,MATCH(O8,$I$3:$I$12,0)),\"\")","v":""}]
[{"$f":"IF(男子!I6=\"\",\"\",男子!I6)","v":""},{"$f":"VLOOKUP($A$5,男子!$W$7:$X$24,2,0)","v":{"$error":"#N/A"}},7,{"$f":"IF(男子!B22=\"\",\"\",男子!B22)","v":""},{"$f":"IF(男子!B21=\"\",\"\",男子!B21)","v":""},{"$f":"IF(男子!F21=\"\",\"\",男子!F21)","v":""},{"$f":"IF(男子!M21=\"\",\"\",男子!M21)","v":""},{"$f":"IF(男子!O21=\"\",\"\",男子!O21)","v":""},{"$f":"IF(男子!Q21=\"\",\"\",男子!Q21)","v":""},{"$f":"IF(男子!G22=\"\",\"\",男子!G22)","v":""},{"$f":"IF(男子!G21=\"\",\"\",男子!G21)","v":""},"D２",{"$error":"#N/A"},{"$f":"IFERROR(MATCH(L9,$H$3:$H$12,0),\"\")","v":""},"S３",{"$error":"#N/A"},""]
["マネージャー",{"$f":"VLOOKUP($A$5,男子!$W$7:$X$24,2,0)","v":{"$error":"#N/A"}},8,{"$f":"IF(男子!B24=\"\",\"\",男子!B24)","v":""},{"$f":"IF(男子!B23=\"\",\"\",男子!B23)","v":""},{"$f":"IF(男子!F23=\"\",\"\",男子!F23)","v":""},{"$f":"IF(男子!M23=\"\",\"\",男子!M23)","v":""},{"$f":"IF(男子!O23=\"\",\"\",男子!O23)","v":""},{"$f":"IF(男子!Q23=\"\",\"\",男子!Q23)","v":""},{"$f":"IF(男子!G24=\"\",\"\",男子!G24)","v":""},{"$f":"IF(男子!G23=\"\",\"\",男子!G23)","v":""},"D２",{"$error":"#N/A"},{"$f":"IFERROR(INDEX(C:C,1/LARGE(INDEX(($H$3:$H$12=L10)/ROW($H$3:$H$12),0),2)),\"\")","v":""}]
[{"$f":"IF(男子!O6=\"\",\"\",男子!O6)","v":""},{"$f":"VLOOKUP($A$5,男子!$W$7:$X$24,2,0)","v":{"$error":"#N/A"}},9,{"$f":"IF(男子!B26=\"\",\"\",男子!B26)","v":""},{"$f":"IF(男子!B25=\"\",\"\",男子!B25)","v":""},{"$f":"IF(男子!F25=\"\",\"\",男子!F25)","v":""},{"$f":"IF(男子!M25=\"\",\"\",男子!M25)","v":""},{"$f":"IF(男子!O25=\"\",\"\",男子!O25)","v":""},{"$f":"IF(男子!Q25=\"\",\"\",男子!Q25)","v":""},{"$f":"IF(男子!G26=\"\",\"\",男子!G26)","v":""},{"$f":"IF(男子!G25=\"\",\"\",男子!G25)","v":""},"D３",{"$error":"#N/A"},{"$f":"IFERROR(MATCH(L11,$H$3:$H$12,0),\"\")","v":""}]
[null,{"$f":"VLOOKUP($A$5,男子!$W$7:$X$24,2,0)","v":{"$error":"#N/A"}},10,{"$f":"IF(男子!B28=\"\",\"\",男子!B28)","v":""},{"$f":"IF(男子!B27=\"\",\"\",男子!B27)","v":""},{"$f":"IF(男子!F27=\"\",\"\",男子!F27)","v":""},{"$f":"IF(男子!M27=\"\",\"\",男子!M27)","v":""},{"$f":"IF(男子!O27=\"\",\"\",男子!O27)","v":""},{"$f":"IF(男子!Q27=\"\",\"\",男子!Q27)","v":""},{"$f":"IF(男子!G28=\"\",\"\",男子!G28)","v":""},{"$f":"IF(男子!G27=\"\",\"\",男子!G27)","v":""},"D３",{"$error":"#N/A"},{"$f":"IFERROR(INDEX(C:C,1/LARGE(INDEX(($H$3:$H$12=L12)/ROW($H$3:$H$12),0),2)),\"\")","v":""}]

{"sheet":"女子DATA","index":5,"n_rows":12,"n_cols":18,"rows_kept":12,"cut":false,"hidden":true,"merged":[]}
[]
[null,"学校№","№","選手名","ふりがな","学年","団体","個人D","個人S","登録","生年月日",null,"氏名","学年","氏名","学年","氏名","学年"]
[{"$f":"VLOOKUP($A$5,女子!$W$7:$X$24,2,0)","v":{"$error":"#N/A"}},{"$f":"VLOOKUP($A$5,女子!$W$7:$X$24,2,0)","v":{"$error":"#N/A"}},1,{"$f":"IF(女子!B10=\"\",\"\",女子!B10)","v":""},{"$f":"IF(女子!B9=\"\",\"\",女子!B9)","v":""},{"$f":"IF(女子!F9=\"\",\"\",女子!F9)","v":""},{"$f":"IF(女子!M9=\"\",\"\",女子!M9)","v":""},{"$f":"IF(女子!O9=\"\",\"\",女子!O9)","v":""},{"$f":"IF(女子!Q9=\"\",\"\",女子!Q9)","v":""},{"$f":"IF(女子!G10=\"\",\"\",女子!G10)","v":""},{"$f":"IF(女子!G9=\"\",\"\",女子!G9)","v":""},"線審１",{"$f":"IF(女子!D35=\"\",\"\",女子!D35)","v":""},{"$f":"IF(女子!E35=\"\",\"\",女子!E35)","v":""},{"$f":"IF(女子!F35=\"\",\"\",女子!F35)","v":""},{"$f":"IF(女子!G35=\"\",\"\",女子!G35)","v":""},{"$f":"IF(女子!H35=\"\",\"\",女子!H35)","v":""},{"$f":"IF(女子!I35=\"\",\"\",女子!I35)","v":""}]
["学校名",{"$f":"VLOOKUP($A$5,女子!$W$7:$X$24,2,0)","v":{"$error":"#N/A"}},2,{"$f":"IF(女子!B12=\"\",\"\",女子!B12)","v":""},{"$f":"IF(女子!B11=\"\",\"\",女子!B11)","v":""},{"$f":"IF(女子!F11=\"\",\"\",女子!F11)","v":""},{"$f":"IF(女子!M11=\"\",\"\",女子!M11)","v":""},{"$f":"IF(女子!O11=\"\",\"\",女子!O11)","v":""},{"$f":"IF(女子!Q11=\"\",\"\",女子!Q11)","v":""},{"$f":"IF(女子!G12=\"\",\"\",女子!G12)","v":""},{"$f":"IF(女子!G11=\"\",\"\",女子!G11)","v":""},"線審２",{"$f":"IF(女子!D36=\"\",\"\",女子!D36)","v":""},{"$f":"IF(女子!E36=\"\",\"\",女子!E36)","v":""},{"$f":"IF(女子!F36=\"\",\"\",女子!F36)","v":""},{"$f":"IF(女子!G36=\"\",\"\",女子!G36)","v":""},{"$f":"IF(女子!H36=\"\",\"\",女子!H36)","v":""},{"$f":"IF(女子!I36=\"\",\"\",女子!I36)","v":""}]
[{"$f":"IF(女子!A4=\"\",\"\",女子!A4)","v":""},{"$f":"VLOOKUP($A$5,女子!$W$7:$X$24,2,0)","v":{"$error":"#N/A"}},3,{"$f":"IF(女子!B14=\"\",\"\",女子!B14)","v":""},{"$f":"IF(女子!B13=\"\",\"\",女子!B13)","v":""},{"$f":"IF(女子!F13=\"\",\"\",女子!F13)","v":""},{"$f":"IF(女子!M13=\"\",\"\",女子!M13)","v":""},{"$f":"IF(女子!O13=\"\",\"\",女子!O13)","v":""},{"$f":"IF(女子!Q13=\"\",\"\",女子!Q13)","v":""},{"$f":"IF(女子!G14=\"\",\"\",女子!G14)","v":""},{"$f":"IF(女子!G13=\"\",\"\",女子!G13)","v":""},"線審３",{"$f":"IF(女子!D37=\"\",\"\",女子!D37)","v":""},{"$f":"IF(女子!E37=\"\",\"\",女子!E37)","v":""},{"$f":"IF(女子!F37=\"\",\"\",女子!F37)","v":""},{"$f":"IF(女子!G37=\"\",\"\",女子!G37)","v":""},{"$f":"IF(女子!H37=\"\",\"\",女子!H37)","v":""},{"$f":"IF(女子!I37=\"\",\"\",女子!I37)","v":""}]
["監督",{"$f":"VLOOKUP($A$5,女子!$W$7:$X$24,2,0)","v":{"$error":"#N/A"}},4,{"$f":"IF(女子!B16=\"\",\"\",女子!B16)","v":""},{"$f":"IF(女子!B15=\"\",\"\",女子!B15)","v":""},{"$f":"IF(女子!F15=\"\",\"\",女子!F15)","v":""},{"$f":"IF(女子!M15=\"\",\"\",女子!M15)","v":""},{"$f":"IF(女子!O15=\"\",\"\",女子!O15)","v":""},{"$f":"IF(女子!Q15=\"\",\"\",女子!Q15)","v":""},{"$f":"IF(女子!G16=\"\",\"\",女子!G16)","v":""},{"$f":"IF(女子!G15=\"\",\"\",女子!G15)","v":""},"線審４",{"$f":"IF(女子!D38=\"\",\"\",女子!D38)","v":""},{"$f":"IF(女子!E38=\"\",\"\",女子!E38)","v":""},{"$f":"IF(女子!F38=\"\",\"\",女子!F38)","v":""},{"$f":"IF(女子!G38=\"\",\"\",女子!G38)","v":""},{"$f":"IF(女子!H38=\"\",\"\",女子!H38)","v":""},{"$f":"IF(女子!I38=\"\",\"\",女子!I38)","v":""}]
[{"$f":"IF(女子!C6=\"\",\"\",女子!C6)","v":""},{"$f":"VLOOKUP($A$5,女子!$W$7:$X$24,2,0)","v":{"$error":"#N/A"}},5,{"$f":"IF(女子!B18=\"\",\"\",女子!B18)","v":""},{"$f":"IF(女子!B17=\"\",\"\",女子!B17)","v":""},{"$f":"IF(女子!F17=\"\",\"\",女子!F17)","v":""},{"$f":"IF(女子!M17=\"\",\"\",女子!M17)","v":""},{"$f":"IF(女子!O17=\"\",\"\",女子!O17)","v":""},{"$f":"IF(女子!Q17=\"\",\"\",女子!Q17)","v":""},{"$f":"IF(女子!G18=\"\",\"\",女子!G18)","v":""},{"$f":"IF(女子!G17=\"\",\"\",女子!G17)","v":""},"D１",{"$f":"$A$3","v":{"$error":"#N/A"}},{"$f":"IFERROR(MATCH(L7,$H$3:$H$12,0),\"\")","v":""},"S１",{"$f":"$A$3","v":{"$error":"#N/A"}},{"$f":"IFERROR(INDEX($C$3:$C$12,MATCH(O7,$I$3:$I$12,0)),\"\")","v":""}]
["コーチ",{"$f":"VLOOKUP($A$5,女子!$W$7:$X$24,2,0)","v":{"$error":"#N/A"}},6,{"$f":"IF(女子!B20=\"\",\"\",女子!B20)","v":""},{"$f":"IF(女子!B19=\"\",\"\",女子!B19)","v":""},{"$f":"IF(女子!F19=\"\",\"\",女子!F19)","v":""},{"$f":"IF(女子!M19=\"\",\"\",女子!M19)","v":""},{"$f":"IF(女子!O19=\"\",\"\",女子!O19)","v":""},{"$f":"IF(女子!Q19=\"\",\"\",女子!Q19)","v":""},{"$f":"IF(女子!G20=\"\",\"\",女子!G20)","v":""},{"$f":"IF(女子!G19=\"\",\"\",女子!G19)","v":""},"D１",{"$f":"$A$3","v":{"$error":"#N/A"}},{"$f":"IFERROR(INDEX(C:C,1/LARGE(INDEX(($H$3:$H$7=L8)/ROW($H$3:$H$7),0),2)),\"\")","v":""},"S２",{"$error":"#N/A"},{"$f":"IFERROR(INDEX($C$3:$C$12,MATCH(O8,$I$3:$I$12,0)),\"\")","v":""}]
[{"$f":"IF(女子!I6=\"\",\"\",女子!I6)","v":""},{"$f":"VLOOKUP($A$5,女子!$W$7:$X$24,2,0)","v":{"$error":"#N/A"}},7,{"$f":"IF(女子!B22=\"\",\"\",女子!B22)","v":""},{"$f":"IF(女子!B21=\"\",\"\",女子!B21)","v":""},{"$f":"IF(女子!F21=\"\",\"\",女子!F21)","v":""},{"$f":"IF(女子!M21=\"\",\"\",女子!M21)","v":""},{"$f":"IF(女子!O21=\"\",\"\",女子!O21)","v":""},{"$f":"IF(女子!Q21=\"\",\"\",女子!Q21)","v":""},{"$f":"IF(女子!G22=\"\",\"\",女子!G22)","v":""},{"$f":"IF(女子!G21=\"\",\"\",女子!G21)","v":""},"D２",{"$error":"#N/A"},{"$f":"IFERROR(MATCH(L9,$H$3:$H$12,0),\"\")","v":""},"S３",{"$error":"#N/A"},""]
["マネージャー",{"$f":"VLOOKUP($A$5,女子!$W$7:$X$24,2,0)","v":{"$error":"#N/A"}},8,{"$f":"IF(女子!B24=\"\",\"\",女子!B24)","v":""},{"$f":"IF(女子!B23=\"\",\"\",女子!B23)","v":""},{"$f":"IF(女子!F23=\"\",\"\",女子!F23)","v":""},{"$f":"IF(女子!M23=\"\",\"\",女子!M23)","v":""},{"$f":"IF(女子!O23=\"\",\"\",女子!O23)","v":""},{"$f":"IF(女子!Q23=\"\",\"\",女子!Q23)","v":""},{"$f":"IF(女子!G24=\"\",\"\",女子!G24)","v":""},{"$f":"IF(女子!G23=\"\",\"\",女子!G23)","v":""},"D２",{"$error":"#N/A"},{"$f":"IFERROR(INDEX(C:C,1/LARGE(INDEX(($H$3:$H$12=L10)/ROW($H$3:$H$12),0),2)),\"\")","v":""}]
[{"$f":"IF(女子!O6=\"\",\"\",女子!O6)","v":""},{"$f":"VLOOKUP($A$5,女子!$W$7:$X$24,2,0)","v":{"$error":"#N/A"}},9,{"$f":"IF(女子!B26=\"\",\"\",女子!B26)","v":""},{"$f":"IF(女子!B25=\"\",\"\",女子!B25)","v":""},{"$f":"IF(女子!F25=\"\",\"\",女子!F25)","v":""},{"$f":"IF(女子!M25=\"\",\"\",女子!M25)","v":""},{"$f":"IF(女子!O25=\"\",\"\",女子!O25)","v":""},{"$f":"IF(女子!Q25=\"\",\"\",女子!Q25)","v":""},{"$f":"IF(女子!G26=\"\",\"\",女子!G26)","v":""},{"$f":"IF(女子!G25=\"\",\"\",女子!G25)","v":""},"D３",{"$error":"#N/A"},{"$f":"IFERROR(MATCH(L11,$H$3:$H$12,0),\"\")","v":""}]
[null,{"$f":"VLOOKUP($A$5,女子!$W$7:$X$24,2,0)","v":{"$error":"#N/A"}},10,{"$f":"IF(女子!B28=\"\",\"\",女子!B28)","v":""},{"$f":"IF(女子!B27=\"\",\"\",女子!B27)","v":""},{"$f":"IF(女子!F27=\"\",\"\",女子!F27)","v":""},{"$f":"IF(女子!M27=\"\",\"\",女子!M27)","v":""},{"$f":"IF(女子!O27=\"\",\"\",女子!O27)","v":""},{"$f":"IF(女子!Q27=\"\",\"\",女子!Q27)","v":""},{"$f":"IF(女子!G28=\"\",\"\",女子!G28)","v":""},{"$f":"IF(女子!G27=\"\",\"\",女子!G27)","v":""},"D３",{"$error":"#N/A"},{"$f":"IFERROR(INDEX(C:C,1/LARGE(INDEX(($H$3:$H$12=L12)/ROW($H$3:$H$12),0),2)),\"\")","v":""}]